On Mon, 21 May 2007, Dragan Noveski wrote:
hi william, i just installed the new version, running
'make install'
there is some strange error, but on the end, phasex is installed:
/usr/share/applications/sysex-phasex.desktop: error: Categories values
must be one of "Core", "Development", "Building",
"Debugger", "IDE",
<snip>
desktop-file-install created an invalid desktop file!
make[2]: *** [install-data-local] Fehler 1
make[2]: Leaving directory
`/home/nowhiskey/software/nove/phasex/phasex-0.10.2'
make[1]: *** [install-am] Fehler 2
make[1]: Leaving directory
`/home/nowhiskey/software/nove/phasex/phasex-0.10.2'
make: *** [install-recursive] Fehler 1
Fixed in version 0.10.3. Actually, the installation of the desktop
file has been removed from the 'make install', since there seem to
be too many differences between distros and what they expect to
happen here. This was the last part of the install, so if you made
it this far, phasex and everything it needs all got installed.
Cheers,
--ww